Target
5-hydroxytryptamine receptor 2C
Ligand
BDBM50459710
Substrate
Meas. Tech.
Radioligand Binding Assay
Ki
1.65±n/a nM
Citation
 Semple, GRen, ASSchrader, TOKasem, MZhu, X 5-HT2C receptor agonists and compositions and methods of use US Patent  US10836764 Publication Date 11/17/2020 
Target
Name:
5-hydroxytryptamine receptor 2C
Synonyms:
5-HT-2C 5-HT2C-INI 5-HTR2C 5-hydroxytryptamine receptor 2C (5-HT-2C) 5HT-1C HTR1C Serotonin (5-HT3) receptor Serotonin Receptor 2C
Type:
G Protein-Coupled Receptor (GPCR)
Mol. Mass.:
51836.79
Organism:
Homo sapiens (Human)
Description:
P28335
Residue:
458
  
Inhibitor
Name:
BDBM50459710
Synonyms:
CHEMBL4212834 | US10836764, Compound 128
Type:
Small organic molecule
Emp. Form.:
C18H20FN3
Mol. Mass.:
297.3699
SMILES:
[H][C@]12CCc3c(Cc4ccc(F)cc4)ccnc3N1CCNC2
: