Target
5-hydroxytryptamine receptor 2A
Ligand
BDBM472990
Substrate
Meas. Tech.
Radioligand Binding Assay
Ki
212±n/a nM
Citation
 Semple, GRen, ASSchrader, TOKasem, MZhu, X 5-HT2C receptor agonists and compositions and methods of use US Patent  US10836764 Publication Date 11/17/2020 
Target
Name:
5-hydroxytryptamine receptor 2A
Synonyms:
5-HT-2 5-HT2A 5-hydroxytryptamine receptor 2A (5HT-2A) 5HT2A_HUMAN HTR2A | Serotonin receptor 2A
Type:
undefined
Mol. Mass.:
52607.65
Organism:
Homo sapiens (Human)
Description:
P28223
Residue:
471
  
Inhibitor
Name:
BDBM472990
Synonyms:
(6aR)-4-((tetrahydro-2H-pyran-2-yl)methyl)- 6,6a,7,8,9,10-hexahydro-5H-pyrazino[1,2- a][1,8]naphthyridine | US10836764, Compound 132
Type:
Small organic molecule
Emp. Form.:
C17H25N3O
Mol. Mass.:
287.3999
SMILES:
C(C1CCCCO1)c1ccnc2N3CCNC[C@H]3CCc12
: