Target
5-hydroxytryptamine receptor 2B
Ligand
BDBM50459709
Substrate
Meas. Tech.
Radioligand Binding Assay
Ki
311±n/a nM
Citation
 Semple, GRen, ASSchrader, TOKasem, MZhu, X 5-HT2C receptor agonists and compositions and methods of use US Patent  US10836764 Publication Date 11/17/2020 
Target
Name:
5-hydroxytryptamine receptor 2B
Synonyms:
5-HT-2B 5-hydroxytryptamine (serotonin) receptor 2B [Homo sapiens] 5-hydroxytryptamine receptor 2C (5HT2C) HTR2B Serotonin 2b (5-HT2b) receptor | Serotonin Receptor 2B
Type:
G Protein-Coupled Receptor (GPCR)
Mol. Mass.:
54312.47
Organism:
Homo sapiens (Human)
Description:
Receptor binding assays were performed using human clone stably expressed in CHO cells.
Residue:
481
  
Inhibitor
Name:
BDBM50459709
Synonyms:
CHEMBL4209052 | US10836764, Compound 137
Type:
Small organic molecule
Emp. Form.:
C16H23N3
Mol. Mass.:
257.3739
SMILES:
C(C1CCC1)c1ccnc2N3CCNCC3CCc12
: