Target
5-hydroxytryptamine receptor 2A
Ligand
BDBM50459714
Substrate
Meas. Tech.
Radioligand Binding Assay
Ki
10.3±n/a nM
Citation
 Semple, GRen, ASSchrader, TOKasem, MZhu, X 5-HT2C receptor agonists and compositions and methods of use US Patent  US10836764 Publication Date 11/17/2020 
Target
Name:
5-hydroxytryptamine receptor 2A
Synonyms:
5-HT-2 5-HT2A 5-hydroxytryptamine receptor 2A (5HT-2A) 5HT2A_HUMAN HTR2A | Serotonin receptor 2A
Type:
undefined
Mol. Mass.:
52607.65
Organism:
Homo sapiens (Human)
Description:
P28223
Residue:
471
  
Inhibitor
Name:
BDBM50459714
Synonyms:
CHEMBL4204710 | US10836764, Compound 149
Type:
Small organic molecule
Emp. Form.:
C15H21N3
Mol. Mass.:
243.3473
SMILES:
[H][C@]12CCc3c(ccnc3N1CCNC2)C1CCC1
: