Target
5-hydroxytryptamine receptor 2B
Ligand
BDBM473013
Substrate
Meas. Tech.
Radioligand Binding Assay
Ki
39.7±n/a nM
Citation
 Semple, GRen, ASSchrader, TOKasem, MZhu, X 5-HT2C receptor agonists and compositions and methods of use US Patent  US10836764 Publication Date 11/17/2020 
Target
Name:
5-hydroxytryptamine receptor 2B
Synonyms:
5-HT-2B 5-hydroxytryptamine (serotonin) receptor 2B [Homo sapiens] 5-hydroxytryptamine receptor 2C (5HT2C) HTR2B Serotonin 2b (5-HT2b) receptor | Serotonin Receptor 2B
Type:
G Protein-Coupled Receptor (GPCR)
Mol. Mass.:
54312.47
Organism:
Homo sapiens (Human)
Description:
Receptor binding assays were performed using human clone stably expressed in CHO cells.
Residue:
481
  
Inhibitor
Name:
BDBM473013
Synonyms:
(R)-3-chloro-4-(3,3,3-trifluoropropyl)- 6,6a,7,8,9,10-hexahydro-5H-pyrazino[1,2- a][1,8]naphthyridine | US10836764, Compound 167
Type:
Small organic molecule
Emp. Form.:
C14H17ClF3N3
Mol. Mass.:
319.753
SMILES:
FC(F)(F)CCc1c(Cl)cnc2N3CCNC[C@H]3CCc12
: