Target
5-hydroxytryptamine receptor 2C
Ligand
BDBM473015
Substrate
Meas. Tech.
Radioligand Binding Assay
Ki
11.2±n/a nM
Citation
 Semple, GRen, ASSchrader, TOKasem, MZhu, X 5-HT2C receptor agonists and compositions and methods of use US Patent  US10836764 Publication Date 11/17/2020 
Target
Name:
5-hydroxytryptamine receptor 2C
Synonyms:
5-HT-2C 5-HT2C-INI 5-HTR2C 5-hydroxytryptamine receptor 2C (5-HT-2C) 5HT-1C HTR1C Serotonin (5-HT3) receptor Serotonin Receptor 2C
Type:
G Protein-Coupled Receptor (GPCR)
Mol. Mass.:
51836.79
Organism:
Homo sapiens (Human)
Description:
P28335
Residue:
458
  
Inhibitor
Name:
BDBM473015
Synonyms:
(R)-4-chloro-2-(methylthio)-6,6a,7,8,9,10- hexahydro-5H-pyrazino[1',2':1,6]pyrido[2,3- d]pyrimidine | US10836764, Compound 169
Type:
Small organic molecule
Emp. Form.:
C11H15ClN4S
Mol. Mass.:
270.782
SMILES:
CSc1nc(Cl)c2CC[C@@H]3CNCCN3c2n1
: