Target
Capsid protein
Ligand
BDBM473050
Substrate
Meas. Tech.
HBV DNA Quantification Assay
EC50
21.4±n/a nM
Citation
 Gutierrez, DAKobayashi, TLazerwith, SELee, RAMorganelli, PAPyun, H Substituted pyrrolizine compounds and uses thereof US Patent  US10836769 Publication Date 11/17/2020 
Target
Name:
Capsid protein
Synonyms:
C Core antigen HBcAg | p21.5
Type:
Enzyme Catalytic Domain
Mol. Mass.:
21105.01
Organism:
Hepatitis B virus genotype C subtype ayr (isolate Human/Japan/Okamoto/-) (HBV-C)
Description:
Residue:
183
  
Inhibitor
Name:
BDBM473050
Synonyms:
US10836769, Example 36
Type:
Small organic molecule
Emp. Form.:
C22H20F2N6O4
Mol. Mass.:
470.4288
SMILES:
Cc1c(C(=O)Nc2ccc(F)c(F)c2)c2CCCn2c1C(=O)C(=O)NC1(COC1)c1c[nH]nn1
: