Target
Capsid protein
Ligand
BDBM473065
Substrate
Meas. Tech.
HBV DNA Quantification Assay
EC50
45.0±n/a nM
Citation
 Gutierrez, DAKobayashi, TLazerwith, SELee, RAMorganelli, PAPyun, H Substituted pyrrolizine compounds and uses thereof US Patent  US10836769 Publication Date 11/17/2020 
Target
Name:
Capsid protein
Synonyms:
C Core antigen HBcAg | p21.5
Type:
Enzyme Catalytic Domain
Mol. Mass.:
21105.01
Organism:
Hepatitis B virus genotype C subtype ayr (isolate Human/Japan/Okamoto/-) (HBV-C)
Description:
Residue:
183
  
Inhibitor
Name:
BDBM473065
Synonyms:
US10836769, Example 51
Type:
Small organic molecule
Emp. Form.:
C25H25F3N6O4
Mol. Mass.:
530.499
SMILES:
COCc1cc(NC(=O)c2c(C)c(C(=O)C(=O)NC3(CC(F)(F)C3)c3c[nH]nn3)n3CCCc23)ccc1F
: