Target
Protein O-GlcNAcase
Ligand
BDBM458385
Substrate
Meas. Tech.
OGA Enzyme Assay
IC50
0.592±0.068 nM
Citation
 Dreyfus, NJLopez, JEWinneroski, Jr., LLWoerly, EM 6-fluoro-2-methylbenzo[d]thiazol-5-yl compounds US Patent  US10836773 Publication Date 11/17/2020 
Target
Name:
Protein O-GlcNAcase
Synonyms:
2-acetamido-2-deoxy-β-D-glucopyranosidase (O-GlcNAcase) Beta-hexosaminidase (O-GlcNAcase) HEXC MEA5 N-acetyl-beta-D-glucosaminidase (O-GlcNAcase) OGA Protein O-GlcNAcase
Type:
Enzyme
Mol. Mass.:
102874.67
Organism:
Homo sapiens (Human)
Description:
O60502
Residue:
916
  
Inhibitor
Name:
BDBM458385
Synonyms:
1-[3-[(3R,5S)-1-[(6-fluoro-2-methyl-1,3-benzothiazol-5-yl)methyl]-5-methyl-pyrrolidin-3-yl]oxy-5,7-dihydropyrrolo[3,4-b]pyridin-6-yl]ethanone US10836773, Example 4
Type:
Small organic molecule
Emp. Form.:
C23H25FN4O2S
Mol. Mass.:
440.534
SMILES:
C[C@H]1C[C@H](CN1Cc1cc2nc(C)sc2cc1F)Oc1cnc2CN(Cc2c1)C(C)=O
: