Target
Mitogen-activated protein kinase 1
Ligand
BDBM365152
Substrate
Meas. Tech.
Enzymatic Assay
IC50
3.22±n/a nM
Citation
 Kolesnikov, ADo, S Serine/threonine kinase inhibitors US Patent  US10842799 Publication Date 11/24/2020 
Target
Name:
Mitogen-activated protein kinase 1
Synonyms:
ERK2 Extracellular signal-regulated kinase 2 Extracellular signal-regulated kinase 2 (ERK2) MAPK 2 MK01_HUMAN Mitogen-activated protein kinase 1 (ERK-2) Mitogen-activated protein kinase 2 PRKM2 | p42-MAPK
Type:
Ser/Thr Protein Kinase
Mol. Mass.:
41392.76
Organism:
Homo sapiens (Human)
Description:
P28482
Residue:
360
  
Inhibitor
Name:
BDBM365152
Synonyms:
9-isobutyl-6-methyl-4-(2-((1- methyl-1H-pyrazol-5- yl)amino)pyridin-4-yl)-8,9- dihydro-1,2,2a1,6- tetraazabenzo[cd]azulen- 7(6H)-one US10842799, I-75 | US9867833, Compound I-75(S)
Type:
Small organic molecule
Emp. Form.:
C23H26N8O
Mol. Mass.:
430.5055
SMILES:
CC(C)CC1CC(=O)N(C)c2cc(cc3nnc1n23)-c1ccnc(Nc2ccnn2C)c1
: