Target
Mitogen-activated protein kinase 1
Ligand
BDBM365186
Substrate
Meas. Tech.
Enzymatic Assay
IC50
0.751±n/a nM
Citation
 Kolesnikov, ADo, S Serine/threonine kinase inhibitors US Patent  US10842799 Publication Date 11/24/2020 
Target
Name:
Mitogen-activated protein kinase 1
Synonyms:
ERK2 Extracellular signal-regulated kinase 2 Extracellular signal-regulated kinase 2 (ERK2) MAPK 2 MK01_HUMAN Mitogen-activated protein kinase 1 (ERK-2) Mitogen-activated protein kinase 2 PRKM2 | p42-MAPK
Type:
Ser/Thr Protein Kinase
Mol. Mass.:
41392.76
Organism:
Homo sapiens (Human)
Description:
P28482
Residue:
360
  
Inhibitor
Name:
BDBM365186
Synonyms:
4-(3-cyclopropyl-3,4- dihydro-5-oxa-1,2,2a1- triazaacenaphthylen-7-yl)-N- (1-methyl-1H-pyrazol-5- yl)pyrimidin-2-amine US10842799, I-95 | US9867833, Compound I-95
Type:
Small organic molecule
Emp. Form.:
C19H18N8O
Mol. Mass.:
374.3992
SMILES:
Cn1nccc1Nc1nccc(n1)-c1cc2OCC(C3CC3)c3nnc(c1)n23
: