Target
Tyrosine-protein kinase SYK
Ligand
BDBM473079
Substrate
Meas. Tech.
Biochemical Assay
IC50
548100±n/a nM
Citation
 Blomgren, PACurrie, KSKropf, JELee, SHMitchell, SASchmitt, ACXu, JZhao, Z Imidazopyridines Syk inhibitors US Patent  US10842803 Publication Date 11/24/2020 
Target
Name:
Tyrosine-protein kinase SYK
Synonyms:
KSYK_HUMAN Spleen Tyrosine Kinase Tyrosine-protein kinase SYK (Syk)
Type:
Enzyme
Mol. Mass.:
72079.99
Organism:
Homo sapiens (Human)
Description:
P43405
Residue:
635
  
Inhibitor
Name:
BDBM473079
Synonyms:
6-{8-[(1-ethyl-1H- pyrazol-3- yl)amino]imidazo[1,2- a]pyridin-6-yl}-3,4- dihydro-2H-1,4- benzoxazin-3-one | US10842803, Structure TABLE 1.9
Type:
Small organic molecule
Emp. Form.:
C20H18N6O2
Mol. Mass.:
374.3959
SMILES:
CCn1ccc(Nc2cc(cn3ccnc23)-c2ccc3OCC(=O)Nc3c2)n1
: