Target
Tyrosine-protein kinase SYK
Ligand
BDBM473112
Substrate
Meas. Tech.
Biochemical Assay
IC50
13000±n/a nM
Citation
 Blomgren, PACurrie, KSKropf, JELee, SHMitchell, SASchmitt, ACXu, JZhao, Z Imidazopyridines Syk inhibitors US Patent  US10842803 Publication Date 11/24/2020 
Target
Name:
Tyrosine-protein kinase SYK
Synonyms:
KSYK_HUMAN Spleen Tyrosine Kinase Tyrosine-protein kinase SYK (Syk)
Type:
Enzyme
Mol. Mass.:
72079.99
Organism:
Homo sapiens (Human)
Description:
P43405
Residue:
635
  
Inhibitor
Name:
BDBM473112
Synonyms:
6-(8-{[5- (hydroxymethyl)-1- methyl-1H-pyrazol-3- yl]amino}imidazo[1,2- a]pyridin-6-yl)-2,3- dihydro-1H-indol-2-one | US10842803, Structure TABLE 1.42
Type:
Small organic molecule
Emp. Form.:
C20H18N6O2
Mol. Mass.:
374.3959
SMILES:
Cn1nc(Nc2cc(cn3ccnc23)-c2ccc3CC(=O)Nc3c2)cc1CO
: