Target
Tyrosine-protein kinase SYK
Ligand
BDBM473117
Substrate
Meas. Tech.
Biochemical Assay
IC50
10000±n/a nM
Citation
 Blomgren, PACurrie, KSKropf, JELee, SHMitchell, SASchmitt, ACXu, JZhao, Z Imidazopyridines Syk inhibitors US Patent  US10842803 Publication Date 11/24/2020 
Target
Name:
Tyrosine-protein kinase SYK
Synonyms:
KSYK_HUMAN Spleen Tyrosine Kinase Tyrosine-protein kinase SYK (Syk)
Type:
Enzyme
Mol. Mass.:
72079.99
Organism:
Homo sapiens (Human)
Description:
P43405
Residue:
635
  
Inhibitor
Name:
BDBM473117
Synonyms:
6-[8-({5- methanesulfonyl- 4H,5H,6H,7H- pyrazolo[1,5-a]pyrazin- 2-yl}amino)imidazo[1,2- a]pyridin-6-yl]-2,3- dihydro-1H-indol-2-one | US10842803, Structure TABLE 1.47
Type:
Small organic molecule
Emp. Form.:
C22H21N7O3S
Mol. Mass.:
463.512
SMILES:
CS(=O)(=O)N1CCn2nc(Nc3cc(cn4ccnc34)-c3ccc4CC(=O)Nc4c3)cc2C1
: