Target
Tyrosine-protein kinase SYK
Ligand
BDBM473146
Substrate
Meas. Tech.
Biochemical Assay
IC50
128000±n/a nM
Citation
 Blomgren, PACurrie, KSKropf, JELee, SHMitchell, SASchmitt, ACXu, JZhao, Z Imidazopyridines Syk inhibitors US Patent  US10842803 Publication Date 11/24/2020 
Target
Name:
Tyrosine-protein kinase SYK
Synonyms:
KSYK_HUMAN Spleen Tyrosine Kinase Tyrosine-protein kinase SYK (Syk)
Type:
Enzyme
Mol. Mass.:
72079.99
Organism:
Homo sapiens (Human)
Description:
P43405
Residue:
635
  
Inhibitor
Name:
BDBM473146
Synonyms:
6-(1H-indazol-6-yl)-5- methyl-N-(5-(piperazin- 1-yl)pyridin-2- yl)imidazo[1,2- a]pyridin-8-amine | US10842803, Structure TABLE 1.76
Type:
Small organic molecule
Emp. Form.:
C24H24N8
Mol. Mass.:
424.501
SMILES:
Cc1c(cc(Nc2ccc(cn2)N2CCNCC2)c2nccn12)-c1ccc2cn[nH]c2c1
: