Target
Induced myeloid leukemia cell differentiation protein Mcl-1 [172-327]
Ligand
BDBM473418
Substrate
Meas. Tech.
Binding Assay
Ki
<100.0±n/a nM
Citation
 Lee, TPelz, NFBelmar, JBian, ZOlejniczak, ETFesik, SWChauder, BA Substituted benzofuran, benzothiophene and indole Mcl-1 inhibitors US Patent  US10844032 Publication Date 11/24/2020 
Target
Name:
Induced myeloid leukemia cell differentiation protein Mcl-1 [172-327]
Synonyms:
BCL2L3 MCL1 Mcl-1 (aa 172-327) | Mcl-1 (residues 172-327)
Type:
Mol. Mass.:
17768.02
Organism:
Homo sapiens (Human)
Description:
Q07820[172-327]
Residue:
156
  
Inhibitor
Name:
BDBM473418
Synonyms:
Preparation of N-((2-(1-benzyl-1H-pyrrole-2-carboxamido)ethyl)sulfonyl)-3-(3-(4-chloro-3,5-dimethylphenoxy)propyl)-7-(3-(hydroxymethyl)-1,5-dimethyl-1H-pyrazol-4-yl)-1H-indole-2-carboxamide | US10844032, Example 207
Type:
Small organic molecule
Emp. Form.:
C40H43ClN6O6S
Mol. Mass.:
771.324
SMILES:
Cc1c(c(CO)nn1C)-c1cccc2c(CCCOc3cc(C)c(Cl)c(C)c3)c([nH]c12)C(=O)NS(=O)(=O)CCNC(=O)c1cccn1Cc1ccccc1
: