Target
Induced myeloid leukemia cell differentiation protein Mcl-1 [172-327]
Ligand
BDBM50159954
Substrate
Meas. Tech.
Binding Assay
Ki
<100.0±n/a nM
Citation
 Lee, TPelz, NFBelmar, JBian, ZOlejniczak, ETFesik, SWChauder, BA Substituted benzofuran, benzothiophene and indole Mcl-1 inhibitors US Patent  US10844032 Publication Date 11/24/2020 
Target
Name:
Induced myeloid leukemia cell differentiation protein Mcl-1 [172-327]
Synonyms:
BCL2L3 MCL1 Mcl-1 (aa 172-327) | Mcl-1 (residues 172-327)
Type:
Mol. Mass.:
17768.02
Organism:
Homo sapiens (Human)
Description:
Q07820[172-327]
Residue:
156
  
Inhibitor
Name:
BDBM50159954
Synonyms:
CHEMBL3785998 US10844032, Example 237
Type:
Small organic molecule
Emp. Form.:
C31H32Cl2N4O5S
Mol. Mass.:
643.581
SMILES:
Cc1cc(OCCCc2c([nH]c3cc(Cl)ccc23)C(=O)NS(=O)(=O)CCNC(=O)[C@@H]2Cc3ccccc3N2)cc(C)c1Cl
: