Target
Induced myeloid leukemia cell differentiation protein Mcl-1 [172-327]
Ligand
BDBM50424725
Substrate
Meas. Tech.
Binding Assay
Ki
120±n/a nM
Citation
 Lee, TPelz, NFBelmar, JBian, ZOlejniczak, ETFesik, SWChauder, BA Substituted benzofuran, benzothiophene and indole Mcl-1 inhibitors US Patent  US10844032 Publication Date 11/24/2020 
Target
Name:
Induced myeloid leukemia cell differentiation protein Mcl-1 [172-327]
Synonyms:
BCL2L3 MCL1 Mcl-1 (aa 172-327) | Mcl-1 (residues 172-327)
Type:
Mol. Mass.:
17768.02
Organism:
Homo sapiens (Human)
Description:
Q07820[172-327]
Residue:
156
  
Inhibitor
Name:
BDBM50424725
Synonyms:
CHEMBL2314177 US10844032, Example 5
Type:
Small organic molecule
Emp. Form.:
C22H17ClO3S
Mol. Mass.:
396.887
SMILES:
OC(=O)c1sc2cc(Cl)ccc2c1CCCOc1cccc2ccccc12
: