Target
WD repeat-containing protein 5
Ligand
BDBM473236
Substrate
Meas. Tech.
TR-FRET Binding Assay
Ki
<0.100±n/a nM
Citation
 Alvarado, JRStauffer, SRGogliotti, RDHan, CMeyers, KMTian, JMacdonald, JDFesik, SWLee, T WDR5 inhibitors and modulators US Patent  US10844044 Publication Date 11/24/2020 
Target
Name:
WD repeat-containing protein 5
Synonyms:
BIG3 WD repeat-containing protein 5 (WDR5) WDR5 | WDR5_HUMAN
Type:
Protein
Mol. Mass.:
36597.13
Organism:
Homo sapiens (Human)
Description:
P61964
Residue:
334
  
Inhibitor
Name:
BDBM473236
Synonyms:
US10844044, Example 194
Type:
Small organic molecule
Emp. Form.:
C32H34F4N6O
Mol. Mass.:
594.6456
SMILES:
CC(C)n1cc(c(n1)C(F)(F)F)-c1cc(Cn2ccn(C3CC3)c2=N)cc(c1)C(=O)N[C@@H](C1CC1)c1ccc(F)c(C)c1
: