Target
WD repeat-containing protein 5
Ligand
BDBM473285
Substrate
Meas. Tech.
TR-FRET Binding Assay
Ki
<0.100±n/a nM
Citation
 Alvarado, JRStauffer, SRGogliotti, RDHan, CMeyers, KMTian, JMacdonald, JDFesik, SWLee, T WDR5 inhibitors and modulators US Patent  US10844044 Publication Date 11/24/2020 
Target
Name:
WD repeat-containing protein 5
Synonyms:
BIG3 WD repeat-containing protein 5 (WDR5) WDR5 | WDR5_HUMAN
Type:
Protein
Mol. Mass.:
36597.13
Organism:
Homo sapiens (Human)
Description:
P61964
Residue:
334
  
Inhibitor
Name:
BDBM473285
Synonyms:
US10844044, Example 115
Type:
Small organic molecule
Emp. Form.:
C31H29F4N5O
Mol. Mass.:
563.5885
SMILES:
Cc1cc(ccc1F)[C@@H](NC(=O)c1cc(Cn2ccn(C3CC3)c2=N)cc(c1)-c1cccnc1C(F)(F)F)C1CC1
: