Target
Tyrosine-protein kinase JAK2
Ligand
BDBM473566
Substrate
Meas. Tech.
Biochemical Kinase Assay
Ki
0.020±n/a nM
Citation
 Colson, PFass, GT Process for preparing JAK inhibitors and intermediates thereof US Patent  US10844057 Publication Date 11/24/2020 
Target
Name:
Tyrosine-protein kinase JAK2
Synonyms:
JAK-2 JAK2_HUMAN Janus kinase 2 (JAK2) | Janus kinase 2 (a protein tyrosine kinase)
Type:
Protein
Mol. Mass.:
130684.68
Organism:
Homo sapiens (Human)
Description:
O60674
Residue:
1132
  
Inhibitor
Name:
BDBM473566
Synonyms:
US10844057, Example 9 US11634419, Example 2
Type:
Small organic molecule
Emp. Form.:
C29H35N7O2
Mol. Mass.:
513.6339
SMILES:
CCN1Cc2[nH]c(nc2C[C@H]1C(=O)N1CC(C1)N(C)C)-c1n[nH]c2cc(ccc12)-c1ccc(O)cc1CC
: