Target
Tyrosine-protein kinase JAK1
Ligand
BDBM473569
Substrate
Meas. Tech.
Biochemical Kinase Assay
Ki
0.032±n/a nM
Citation
 Colson, PFass, GT Process for preparing JAK inhibitors and intermediates thereof US Patent  US10844057 Publication Date 11/24/2020 
Target
Name:
Tyrosine-protein kinase JAK1
Synonyms:
JAK-1 JAK1A JAK1_HUMAN Janus kinase 1 (JAK1) | Janus kinase 1 JAK1
Type:
Protein
Mol. Mass.:
133293.73
Organism:
Homo sapiens (Human)
Description:
P23458
Residue:
1154
  
Inhibitor
Name:
BDBM473569
Synonyms:
US10844057, Example 12 US11634419, Example 5
Type:
Small organic molecule
Emp. Form.:
C30H37N7O2
Mol. Mass.:
527.6605
SMILES:
CCCN1Cc2[nH]c(nc2C[C@H]1C(=O)N1CC(C1)N(C)C)-c1n[nH]c2cc(ccc12)-c1ccc(O)cc1CC
: