Target
Vascular endothelial growth factor receptor 2
Ligand
BDBM473601
Substrate
Meas. Tech.
Experiment on VEGFR-2 Tyrosine Kinase Inhibitory Activity
IC50
526±n/a nM
Citation
 Cho, EHShin, HJKi, MHKwon, HSLee, JWJoo, JHLee, KKKim, JMPark, YBKang, SHCho, HMKim, HTAhn, SKHong, SPKim, SH Pyridine derivative inhibiting RAF kinase and vascular endothelial growth factor receptor, method for preparing same, pharmaceutical composition containing same, and use thereof US Patent  US10844062 Publication Date 11/24/2020 
Target
Name:
Vascular endothelial growth factor receptor 2
Synonyms:
CD_antigen=CD309 Fetal liver kinase 1 (FLK-1) KDR Protein-tyrosine kinase receptor Flk-1 VEGFR-2 VEGFR2 Vascular Endothelial Growth Factor Receptor Kinase 2 Vascular endothelial growth factor receptor 2 (KDR) Vascular endothelial growth factor receptor 2 (VEGFR2) Vascular endothelial growth factor receptor-2 (VEGFR-2)
Type:
Receptor Tyrosine Kinase
Mol. Mass.:
151510.97
Organism:
Homo sapiens (Human)
Description:
P35968
Residue:
1356
  
Inhibitor
Name:
BDBM473601
Synonyms:
US10844062, Example 37
Type:
Small organic molecule
Emp. Form.:
C24H14F2N8O
Mol. Mass.:
468.4178
SMILES:
Fc1ccc(NC(=O)c2cccc(c2)C#N)c(F)c1Nc1ncccc1-c1ncnc2[nH]cnc12
: