Target
Proto-oncogene tyrosine-protein kinase receptor Ret
Ligand
BDBM473663
Substrate
Meas. Tech.
Time-Resolved Fluorescence Transfer (FRET) Assay
IC50
26.5±n/a nM
Citation
 Jordan, AMNewton, RWaszkowycz, BSutton, JMHynd, GPaoletta, SFordyce, EA Heterocyclic compounds as RET kinase inhibitors US Patent  US10844067 Publication Date 11/24/2020 
Target
Name:
Proto-oncogene tyrosine-protein kinase receptor Ret
Synonyms:
CDHF12 Cadherin family member 12 Proto-oncogene c-Ret RET51 Tyrosine-protein kinase Ret (RET)
Type:
Protein
Mol. Mass.:
124318.29
Organism:
Homo sapiens (Human)
Description:
P07949
Residue:
1114
  
Inhibitor
Name:
BDBM473663
Synonyms:
3-(1H-Indol-2-yl)-1-(trans-4- morpholinocyclohexyl)-1H-pyrazolo[3,4- d]pyrimidin-4-amine US11661423, Example 6
Type:
Small organic molecule
Emp. Form.:
C23H27N7O
Mol. Mass.:
417.5068
SMILES:
Nc1ncnc2n(nc(-c3cc4ccccc4[nH]3)c12)C1CC[C@@H](CC1)N1CCOCC1
: