Target
Proto-oncogene tyrosine-protein kinase receptor Ret
Ligand
BDBM473695
Substrate
Meas. Tech.
Time-Resolved Fluorescence Transfer (FRET) Assay
IC50
1.30±n/a nM
Citation
 Jordan, AMNewton, RWaszkowycz, BSutton, JMHynd, GPaoletta, SFordyce, EA Heterocyclic compounds as RET kinase inhibitors US Patent  US10844067 Publication Date 11/24/2020 
Target
Name:
Proto-oncogene tyrosine-protein kinase receptor Ret
Synonyms:
CDHF12 Cadherin family member 12 Proto-oncogene c-Ret RET51 Tyrosine-protein kinase Ret (RET)
Type:
Protein
Mol. Mass.:
124318.29
Organism:
Homo sapiens (Human)
Description:
P07949
Residue:
1114
  
Inhibitor
Name:
BDBM473695
Synonyms:
1-(cis-4-Aminocyclohexyl)-3-(3-chloro-1H- pyrrolo[2,3-b]pyridin-2-yl)-1H- pyrazolo[3,4-d]pyrimidin-4-amine dihydrochloride US11661423, Example 38
Type:
Small organic molecule
Emp. Form.:
C18H19ClN8
Mol. Mass.:
382.85
SMILES:
N[C@H]1CCC(CC1)n1nc(-c2[nH]c3ncccc3c2Cl)c2c(N)ncnc12
: