Target
Proto-oncogene tyrosine-protein kinase receptor Ret
Ligand
BDBM473704
Substrate
Meas. Tech.
Time-Resolved Fluorescence Transfer (FRET) Assay
IC50
5.00±n/a nM
Citation
 Jordan, AMNewton, RWaszkowycz, BSutton, JMHynd, GPaoletta, SFordyce, EA Heterocyclic compounds as RET kinase inhibitors US Patent  US10844067 Publication Date 11/24/2020 
Target
Name:
Proto-oncogene tyrosine-protein kinase receptor Ret
Synonyms:
CDHF12 Cadherin family member 12 Proto-oncogene c-Ret RET51 Tyrosine-protein kinase Ret (RET)
Type:
Protein
Mol. Mass.:
124318.29
Organism:
Homo sapiens (Human)
Description:
P07949
Residue:
1114
  
Inhibitor
Name:
BDBM473704
Synonyms:
5-(1H-Indol-2-yl)-7-isopropyl-pyrrolo[2,3- d]pyrimidin-4-amine US11661423, Example 47
Type:
Small organic molecule
Emp. Form.:
C17H17N5
Mol. Mass.:
291.3504
SMILES:
CC(C)n1cc(-c2cc3ccccc3[nH]2)c2c(N)ncnc12
: