Target
Deoxyuridine 5'-triphosphate nucleotidohydrolase, mitochondrial
Ligand
BDBM473978
Substrate
Meas. Tech.
dUTPase Inhibition
IC50
800±n/a nM
Citation
 Spyvee, M Hydantoin containing deoxyuridine triphosphatase inhibitors US Patent  US10858344 Publication Date 12/8/2020 
Target
Name:
Deoxyuridine 5'-triphosphate nucleotidohydrolase, mitochondrial
Synonyms:
DUT Deoxyuridine 5'-triphosphate nucleotidohydrolase (dUTPase) dUTP pyrophosphatase
Type:
Enzyme
Mol. Mass.:
26574.03
Organism:
Homo sapiens (Human)
Description:
P33316
Residue:
252
  
Inhibitor
Name:
BDBM473978
Synonyms:
US10858344, Example 88
Type:
Small organic molecule
Emp. Form.:
C19H26F3N3O6S
Mol. Mass.:
481.486
SMILES:
CC[C@@](O)(CNS(=O)(=O)CCCCN1CC(=O)NC1=O)c1ccc(F)c(OCC(F)F)c1
: