Target
Deoxyuridine 5'-triphosphate nucleotidohydrolase, mitochondrial
Ligand
BDBM473985
Substrate
Meas. Tech.
dUTPase Inhibition
IC50
>25000±n/a nM
Citation
 Spyvee, M Hydantoin containing deoxyuridine triphosphatase inhibitors US Patent  US10858344 Publication Date 12/8/2020 
Target
Name:
Deoxyuridine 5'-triphosphate nucleotidohydrolase, mitochondrial
Synonyms:
DUT Deoxyuridine 5'-triphosphate nucleotidohydrolase (dUTPase) dUTP pyrophosphatase
Type:
Enzyme
Mol. Mass.:
26574.03
Organism:
Homo sapiens (Human)
Description:
P33316
Residue:
252
  
Inhibitor
Name:
BDBM473985
Synonyms:
US10858344, Example 95
Type:
Small organic molecule
Emp. Form.:
C21H29N3O5S
Mol. Mass.:
435.537
SMILES:
CC[C@@H](NS(=O)(=O)CC\C=C\CN1CC(=O)NC1=O)c1cccc(OCC2CC2)c1
: