Target
Tyrosine-protein kinase BTK
Ligand
BDBM474105
Substrate
Meas. Tech.
IMAP (immobilized metal ion affinity-based fluorescence polarization) assay
IC50
5.00±n/a nM
Citation
 Podoll, TEvarts, JKaptein, A Imidazopyrazine inhibitors of Bruton's tyrosine kinase US Patent  US10858364 Publication Date 12/8/2020 
Target
Name:
Tyrosine-protein kinase BTK
Synonyms:
AGMX1 Agammaglobulinaemia tyrosine kinase B cell progenitor kinase BPK BTK_HUMAN Tyrosine Kinase BTK Tyrosine-protein kinase BTK (BTK)
Type:
Enzyme
Mol. Mass.:
76289.95
Organism:
Homo sapiens (Human)
Description:
Q06187
Residue:
659
  
Inhibitor
Name:
BDBM474105
Synonyms:
US10858364, formula (I)
Type:
Small organic molecule
Emp. Form.:
C26H23N7O3
Mol. Mass.:
481.5059
SMILES:
CC#CC(=O)NCCCC(=O)c1nc(-c2ccc(cc2)C(=O)Nc2ccccn2)c2c(N)nccn12
: