Target
Tyrosine-protein kinase BTK
Ligand
BDBM474106
Substrate
Meas. Tech.
IMAP (immobilized metal ion affinity-based fluorescence polarization) assay
IC50
9.30±n/a nM
Citation
 Podoll, TEvarts, JKaptein, A Imidazopyrazine inhibitors of Bruton's tyrosine kinase US Patent  US10858364 Publication Date 12/8/2020 
Target
Name:
Tyrosine-protein kinase BTK
Synonyms:
AGMX1 Agammaglobulinaemia tyrosine kinase B cell progenitor kinase BPK BTK_HUMAN Tyrosine Kinase BTK Tyrosine-protein kinase BTK (BTK)
Type:
Enzyme
Mol. Mass.:
76289.95
Organism:
Homo sapiens (Human)
Description:
Q06187
Residue:
659
  
Inhibitor
Name:
BDBM474106
Synonyms:
US10858364, Formula (II)
Type:
Small organic molecule
Emp. Form.:
C27H25N7O4
Mol. Mass.:
511.5319
SMILES:
COc1cc(ccc1C(=O)Nc1ccccn1)-c1nc(C(=O)CCCNC(=O)C#CC)n2ccnc(N)c12
: