Target
Receptor tyrosine-protein kinase erbB-4
Ligand
BDBM474105
Substrate
Meas. Tech.
Z′-LYTE assay
IC50
343±n/a nM
Citation
 Podoll, TEvarts, JKaptein, A Imidazopyrazine inhibitors of Bruton's tyrosine kinase US Patent  US10858364 Publication Date 12/8/2020 
Target
Name:
Receptor tyrosine-protein kinase erbB-4
Synonyms:
ERBB4 Epidermal growth factor receptor ErbB-4 (HER4) Tyrosine Kinase Proto-oncogene c-ErbB-4 Receptor protein-tyrosine kinase erbB-4 Tyrosine kinase-type cell surface receptor HER4 (HER4)
Type:
Protein
Mol. Mass.:
146803.56
Organism:
Homo sapiens (Human)
Description:
Q15303
Residue:
1308
  
Inhibitor
Name:
BDBM474105
Synonyms:
US10858364, formula (I)
Type:
Small organic molecule
Emp. Form.:
C26H23N7O3
Mol. Mass.:
481.5059
SMILES:
CC#CC(=O)NCCCC(=O)c1nc(-c2ccc(cc2)C(=O)Nc2ccccn2)c2c(N)nccn12
: