Target
Tyrosine-protein kinase Blk
Ligand
BDBM474105
Substrate
Meas. Tech.
Z′-LYTE assay
IC50
6170±n/a nM
Citation
 Podoll, TEvarts, JKaptein, A Imidazopyrazine inhibitors of Bruton's tyrosine kinase US Patent  US10858364 Publication Date 12/8/2020 
Target
Name:
Tyrosine-protein kinase Blk
Synonyms:
B lymphoid tyrosine kinase BLK_HUMAN Tyrosine-protein kinase BLK (BLK) | p55-Blk
Type:
Protein
Mol. Mass.:
57711.88
Organism:
Homo sapiens (Human)
Description:
P51451
Residue:
505
  
Inhibitor
Name:
BDBM474105
Synonyms:
US10858364, formula (I)
Type:
Small organic molecule
Emp. Form.:
C26H23N7O3
Mol. Mass.:
481.5059
SMILES:
CC#CC(=O)NCCCC(=O)c1nc(-c2ccc(cc2)C(=O)Nc2ccccn2)c2c(N)nccn12
: