Target
Tyrosine-protein kinase BTK
Ligand
BDBM474107
Substrate
Meas. Tech.
BTK-WT and BTK-C481S LanthaScreen
Ki
188±9 nM
Citation
 Podoll, TEvarts, JKaptein, A Imidazopyrazine inhibitors of Bruton's tyrosine kinase US Patent  US10858364 Publication Date 12/8/2020 
Target
Name:
Tyrosine-protein kinase BTK
Synonyms:
AGMX1 Agammaglobulinaemia tyrosine kinase B cell progenitor kinase BPK BTK_HUMAN Tyrosine Kinase BTK Tyrosine-protein kinase BTK (BTK)
Type:
Enzyme
Mol. Mass.:
76289.95
Organism:
Homo sapiens (Human)
Description:
Q06187
Residue:
659
  
Inhibitor
Name:
BDBM474107
Synonyms:
Pazopanib metabolite M27 | US10858364, Compound M27
Type:
Small organic molecule
Emp. Form.:
C20H21N7O2S
Mol. Mass.:
423.491
SMILES:
Cc1n(C)nc2cc(Nc3ccnc(Nc4ccc(C)c(c4)S(N)(=O)=O)n3)ccc12
: