Target
Dual specificity calcium/calmodulin-dependent 3',5'-cyclic nucleotide phosphodiesterase 1C
Ligand
BDBM474109
Substrate
Meas. Tech.
PDE1 Inhibition Assay
IC50
11.0±n/a nM
Citation
 Kehler, JRasmussen, LKLanggård, MJessing, MJuhl, KVital, PJ Imidazopyrazinones as PDE1 inhibitors US Patent  US10858362 Publication Date 12/8/2020 
Target
Name:
Dual specificity calcium/calmodulin-dependent 3',5'-cyclic nucleotide phosphodiesterase 1C
Synonyms:
3',5'-cyclic-AMP phosphodiesterase Calcium/calmodulin-dependent 3',5'-cyclic nucleotide phosphodiesterase 1C Hcam3 PDE1C_HUMAN Phosphodiesterase 1C | Phosphodiesterase, PDE1/PDE5
Type:
Enzyme
Mol. Mass.:
80778.58
Organism:
Homo sapiens (Human)
Description:
Q14123
Residue:
709
  
Inhibitor
Name:
BDBM474109
Synonyms:
6-Benzyl-7-(3-fluorobenzyl)-3- (tetrahydro-2H-pyran-4- yl)imidazo[1,5-a]pyrazin-8(7H)- one US10912773, Example 2 | US11472810, Example 2
Type:
Small organic molecule
Emp. Form.:
C25H24FN3O2
Mol. Mass.:
417.4754
SMILES:
Fc1cccc(Cn2c(Cc3ccccc3)cn3c(ncc3c2=O)C2CCOCC2)c1
: