Target
Dual specificity calcium/calmodulin-dependent 3',5'-cyclic nucleotide phosphodiesterase 1C
Ligand
BDBM474132
Substrate
Meas. Tech.
PDE1 Inhibition Assay
IC50
9.00±n/a nM
Citation
 Kehler, JRasmussen, LKLanggård, MJessing, MJuhl, KVital, PJ Imidazopyrazinones as PDE1 inhibitors US Patent  US10858362 Publication Date 12/8/2020 
Target
Name:
Dual specificity calcium/calmodulin-dependent 3',5'-cyclic nucleotide phosphodiesterase 1C
Synonyms:
3',5'-cyclic-AMP phosphodiesterase Calcium/calmodulin-dependent 3',5'-cyclic nucleotide phosphodiesterase 1C Hcam3 PDE1C_HUMAN Phosphodiesterase 1C | Phosphodiesterase, PDE1/PDE5
Type:
Enzyme
Mol. Mass.:
80778.58
Organism:
Homo sapiens (Human)
Description:
Q14123
Residue:
709
  
Inhibitor
Name:
BDBM474132
Synonyms:
6-Methyl-7-(3-methylbenzyl)-3- (tetrahydro-2H-pyran-4- yl)imidazo[1,5-a]pyrazin-8(7H)- one US10912773, Example 25 | US11472810, Example 25
Type:
Small organic molecule
Emp. Form.:
C20H23N3O2
Mol. Mass.:
337.4155
SMILES:
Cc1cccc(Cn2c(C)cn3c(ncc3c2=O)C2CCOCC2)c1
: