Target
Dual specificity calcium/calmodulin-dependent 3',5'-cyclic nucleotide phosphodiesterase 1B
Ligand
BDBM474185
Substrate
Meas. Tech.
PDE1 Inhibition Assay
IC50
6.00±n/a nM
Citation
 Kehler, JRasmussen, LKLanggård, MJessing, MJuhl, KVital, PJ Imidazopyrazinones as PDE1 inhibitors US Patent  US10858362 Publication Date 12/8/2020 
Target
Name:
Dual specificity calcium/calmodulin-dependent 3',5'-cyclic nucleotide phosphodiesterase 1B
Synonyms:
63 kDa Cam-PDE Calcium/calmodulin-dependent 3',5'-cyclic nucleotide phosphodiesterase 1B PDE1B PDE1B_HUMAN Phosphodiesterase 1B Phosphodiesterase Type 1 (PDE1B) | Phosphodiesterase, PDE1/PDE5
Type:
Enzyme
Mol. Mass.:
61366.51
Organism:
Homo sapiens (Human)
Description:
Residue:
536
  
Inhibitor
Name:
BDBM474185
Synonyms:
6-methyl-7-(((trans)-4- methylcyclohexyl)methyl)-3- (tetrahydro-2H-pyran-4- yl)imidazo[1,5-a]pyrazin-8(7H)- one US10858362, Example 66--trans
Type:
Small organic molecule
Emp. Form.:
C20H29N3O2
Mol. Mass.:
343.4632
SMILES:
CC1CCC(Cn2c(C)cn3c(ncc3c2=O)C2CCOCC2)CC1
: