Target
Adenosine receptor A1
Ligand
BDBM474233
Substrate
Meas. Tech.
Binding Affinities to Different Adenosine Receptors
IC50
0.100±n/a nM
Citation
 Zeng, QQi, CTsui, HYang, ZZhang, X Triazolo-pyrimidine compounds and uses thereof US Patent  US10858365 Publication Date 12/8/2020 
Target
Name:
Adenosine receptor A1
Synonyms:
A1 adenosine receptor (hA1) AA1R_HUMAN ADORA1 Adenosine A1-receptor Adenosine receptor A1 (hA1) | Adenosine transporter (AdT)
Type:
G Protein-Coupled Receptor (GPCR)
Mol. Mass.:
36520.92
Organism:
Homo sapiens (Human)
Description:
P30542
Residue:
326
  
Inhibitor
Name:
BDBM474233
Synonyms:
5-[5-amino-7-(4-fluorophenyl)-2-[(3-fluoropyrid in-2-yl)methyl]-[1,2,4]triazolo[1,5-c]pyrimidin-8- yl]-l-(propan-2-yl)-l,2-dihydropyridin-2-one US11629147, Cmpd. 55
Type:
Small organic molecule
Emp. Form.:
C25H21F2N7O
Mol. Mass.:
473.4773
SMILES:
CC(C)n1cc(ccc1=O)-c1c(nc(N)n2nc(Cc3ncccc3F)nc12)-c1ccc(F)cc1
: