Target
Adenosine receptor A2a
Ligand
BDBM474315
Substrate
Meas. Tech.
Binding Affinities to Different Adenosine Receptors
IC50
0.100±n/a nM
Citation
 Zeng, QQi, CTsui, HYang, ZZhang, X Triazolo-pyrimidine compounds and uses thereof US Patent  US10858365 Publication Date 12/8/2020 
Target
Name:
Adenosine receptor A2a
Synonyms:
A2A adenosine receptor (hA2A) ADENOSINE A2 ADORA2 Adenosine A2A receptor (A2AAR)
Type:
G Protein-Coupled Receptor (GPCR)
Mol. Mass.:
44716.46
Organism:
Homo sapiens (Human)
Description:
P29274
Residue:
412
  
Inhibitor
Name:
BDBM474315
Synonyms:
7-(4-fluorophenyl)-8-(3-methylimidazo[1,2-a] pyridin-6-yl)-2-((tetrahydrofuran-3-yl)methyl)-[l,2, 4]triazolo[1,5-c]pyrimidin-5-amine(isomer 1) | US10858365, Compound 105-1
Type:
Small organic molecule
Emp. Form.:
C24H22FN7O
Mol. Mass.:
443.4762
SMILES:
Cc1cnc2ccc(cn12)-c1c(nc(N)n2nc(CC3CCOC3)nc12)-c1ccc(F)cc1
: