Target
Polymerase acidic protein
Ligand
BDBM474343
Substrate
Meas. Tech.
Endonuclease Inhibition Assay (PA FP Assay)
IC50
10.00±n/a nM
Citation
 Jain, RKoester, DCManning, JRSutton, JCTaft, BRWan, LZhao, Q Tricyclic compounds useful to treat orthomyxovirus infections US Patent  US10858366 Publication Date 12/8/2020 
Target
Name:
Polymerase acidic protein
Synonyms:
PA RNA-directed RNA polymerase subunit P2
Type:
Protein
Mol. Mass.:
82806.72
Organism:
Description:
P31343
Residue:
716
 
Inhibitor
Name:
BDBM474343
Synonyms:
(S)-6-Benzhydryl-11-hydroxy-5H- imidazo[1,2-a]pyrido[2,1-c]pyrazin-10(6H)- one US11453677, Example 4
Type:
Small organic molecule
Emp. Form.:
C23H19N3O2
Mol. Mass.:
369.4159
SMILES:
Oc1c2-c3nccn3C[C@H](C(c3ccccc3)c3ccccc3)n2ccc1=O
: