Target
Polymerase acidic protein
Ligand
BDBM474369
Substrate
Meas. Tech.
Endonuclease Inhibition Assay (PA FP Assay)
IC50
100.0±n/a nM
Citation
 Jain, RKoester, DCManning, JRSutton, JCTaft, BRWan, LZhao, Q Tricyclic compounds useful to treat orthomyxovirus infections US Patent  US10858366 Publication Date 12/8/2020 
Target
Name:
Polymerase acidic protein
Synonyms:
PA RNA-directed RNA polymerase subunit P2
Type:
Protein
Mol. Mass.:
82806.72
Organism:
Description:
P31343
Residue:
716
 
Inhibitor
Name:
BDBM474369
Synonyms:
(S)-6-benzhydryl-11-hydroxy-3- (hydroxymethyl)-5,6-dihydro-10H- imidazo[1,2-a]pyrido[2,1-c]pyrazin-10-one US11453677, Example 54
Type:
Small organic molecule
Emp. Form.:
C24H21N3O3
Mol. Mass.:
399.4418
SMILES:
OCc1cnc2-c3c(O)c(=O)ccn3[C@H](Cn12)C(c1ccccc1)c1ccccc1
: