Target
Neuraminidase
Ligand
BDBM474369
Substrate
EC50
1600±n/a nM
Citation
 Jain, RKoester, DCManning, JRSutton, JCTaft, BRWan, LZhao, Q Tricyclic compounds useful to treat orthomyxovirus infections US Patent  US10858366 Publication Date 12/8/2020 
Target
Name:
Neuraminidase
Synonyms:
Type:
Protein
Mol. Mass.:
51409.73
Organism:
Description:
Q1P9S2
Residue:
466
 
Inhibitor
Name:
BDBM474369
Synonyms:
(S)-6-benzhydryl-11-hydroxy-3- (hydroxymethyl)-5,6-dihydro-10H- imidazo[1,2-a]pyrido[2,1-c]pyrazin-10-one US11453677, Example 54
Type:
Small organic molecule
Emp. Form.:
C24H21N3O3
Mol. Mass.:
399.4418
SMILES:
OCc1cnc2-c3c(O)c(=O)ccn3[C@H](Cn12)C(c1ccccc1)c1ccccc1
: