Target
Neuraminidase
Ligand
BDBM474374
Substrate
Meas. Tech.
Influenza Virus Neuraminidase Assay (NA Assay)
EC50
1700±n/a nM
Citation
 Jain, RKoester, DCManning, JRSutton, JCTaft, BRWan, LZhao, Q Tricyclic compounds useful to treat orthomyxovirus infections US Patent  US10858366 Publication Date 12/8/2020 
Target
Name:
Neuraminidase
Synonyms:
NA | NRAM_I33A0
Type:
PROTEIN
Mol. Mass.:
49687.56
Organism:
Influenza A virus (strain A/Wilson-Smith/1933 H1N1) (Influenza A virus(strain A/WS/1933 H1N1))
Description:
ChEMBL_881601
Residue:
453
  
Inhibitor
Name:
BDBM474374
Synonyms:
(S)-6-benzhydryl-3-((dimethylamino)methyl)- 11-hydroxy-5,6-dihydro-10H-imidazo[1,2- a]pyrido[2,1-c]pyrazin-10-one | US10858366, Example 64
Type:
Small organic molecule
Emp. Form.:
C26H26N4O2
Mol. Mass.:
426.5102
SMILES:
CN(C)Cc1cnc2-c3c(O)c(=O)ccn3[C@H](Cn12)C(c1ccccc1)c1ccccc1
: