Target
Neuraminidase
Ligand
BDBM474376
Substrate
EC50
17000±n/a nM
Citation
 Jain, RKoester, DCManning, JRSutton, JCTaft, BRWan, LZhao, Q Tricyclic compounds useful to treat orthomyxovirus infections US Patent  US10858366 Publication Date 12/8/2020 
Target
Name:
Neuraminidase
Synonyms:
Type:
Protein
Mol. Mass.:
51409.73
Organism:
Description:
Q1P9S2
Residue:
466
 
Inhibitor
Name:
BDBM474376
Synonyms:
(S)-6-benzhydryl-11-hydroxy-N,N-dimethyl- 10-oxo-5,6-dihydro-10H-imidazo[1,2- a]pyrido[2,1-c]pyrazine-3-carboxamide | US10858366, Example 68
Type:
Small organic molecule
Emp. Form.:
C26H24N4O3
Mol. Mass.:
440.4938
SMILES:
CN(C)C(=O)c1cnc2-c3c(O)c(=O)ccn3[C@H](Cn12)C(c1ccccc1)c1ccccc1
: