Target
Neuraminidase
Ligand
BDBM474377
Substrate
EC50
>50000±n/a nM
Citation
 Jain, RKoester, DCManning, JRSutton, JCTaft, BRWan, LZhao, Q Tricyclic compounds useful to treat orthomyxovirus infections US Patent  US10858366 Publication Date 12/8/2020 
Target
Name:
Neuraminidase
Synonyms:
NA | NRAM_I71A1
Type:
PROTEIN
Mol. Mass.:
52105.18
Organism:
Influenza A virus (strain A/Memphis/1/1971 H3N2)
Description:
ChEMBL_578382
Residue:
469
  
Inhibitor
Name:
BDBM474377
Synonyms:
(S)-6-benzhydryl-11-hydroxy-N-methyl-10- oxo-5,6-dihydro-10H-imidazo[1,2- a]pyrido[2,1-c]pyrazine-3-carboxamide | US10858366, Example 69
Type:
Small organic molecule
Emp. Form.:
C25H22N4O3
Mol. Mass.:
426.4672
SMILES:
CNC(=O)c1cnc2-c3c(O)c(=O)ccn3[C@H](Cn12)C(c1ccccc1)c1ccccc1
: