Target
5-hydroxytryptamine receptor 7
Ligand
BDBM474383
Substrate
Meas. Tech.
Radiolabel Binding Studies for Serotonin 5HT7 Receptors
IC50
81.0±n/a nM
Citation
 Canney, DJBlass, BEBlattner, KMPippin, DA Modulators of the 5-hydroxytryptamine receptor 7 and their method of use US Patent  US10858368 Publication Date 12/8/2020 
Target
Name:
5-hydroxytryptamine receptor 7
Synonyms:
5-HT-7 5-HT7 5-HT7S 5HT7 HTR7 | Serotonin receptor 7
Type:
G Protein-Coupled Receptor (GPCR)
Mol. Mass.:
53573.08
Organism:
Homo sapiens (Human)
Description:
P34969
Residue:
479
  
Inhibitor
Name:
BDBM474383
Synonyms:
US10858368, Entry 3 | US11319327, Entry 3
Type:
Small organic molecule
Emp. Form.:
C23H33N3O4
Mol. Mass.:
415.5258
SMILES:
COC(=O)N1CCC2(CC(CCN3CCN(CC3)c3ccc(C)cc3)OC2=O)CC1
: