Target
5-hydroxytryptamine receptor 7
Ligand
BDBM474390
Substrate
Meas. Tech.
Radiolabel Binding Studies for Serotonin 5HT7 Receptors
IC50
64.0±n/a nM
Citation
 Canney, DJBlass, BEBlattner, KMPippin, DA Modulators of the 5-hydroxytryptamine receptor 7 and their method of use US Patent  US10858368 Publication Date 12/8/2020 
Target
Name:
5-hydroxytryptamine receptor 7
Synonyms:
5-HT-7 5-HT7 5-HT7S 5HT7 HTR7 | Serotonin receptor 7
Type:
G Protein-Coupled Receptor (GPCR)
Mol. Mass.:
53573.08
Organism:
Homo sapiens (Human)
Description:
P34969
Residue:
479
  
Inhibitor
Name:
BDBM474390
Synonyms:
US10858368, Entry 10 | US11319327, Entry 10
Type:
Small organic molecule
Emp. Form.:
C27H35N3O4S
Mol. Mass.:
497.65
SMILES:
Cc1ccc(cc1)N1CCN(CCC2CC3(CCN(CC3)S(=O)(=O)c3ccccc3)C(=O)O2)CC1
: