Target
5-hydroxytryptamine receptor 7
Ligand
BDBM474402
Substrate
Meas. Tech.
Radiolabel Binding Studies for Serotonin 5HT7 Receptors
IC50
202±n/a nM
Citation
 Canney, DJBlass, BEBlattner, KMPippin, DA Modulators of the 5-hydroxytryptamine receptor 7 and their method of use US Patent  US10858368 Publication Date 12/8/2020 
Target
Name:
5-hydroxytryptamine receptor 7
Synonyms:
5-HT-7 5-HT7 5-HT7S 5HT7 HTR7 | Serotonin receptor 7
Type:
G Protein-Coupled Receptor (GPCR)
Mol. Mass.:
53573.08
Organism:
Homo sapiens (Human)
Description:
P34969
Residue:
479
  
Inhibitor
Name:
BDBM474402
Synonyms:
US10858368, Entry 22 | US11319327, Entry 22
Type:
Small organic molecule
Emp. Form.:
C21H31N3O5S
Mol. Mass.:
437.553
SMILES:
CS(=O)(=O)N1CCC2(CC(CCN3CCN(CC3)c3ccc(O)cc3)OC2=O)CC1
: