Target
Monoglyceride lipase
Ligand
BDBM474418
Substrate
Meas. Tech.
MAGL Enzymatic Assay (30 minute)
IC50
10.4±n/a nM
Citation
 Brodney, MAButler, CRMcAllister, LAHelal, CJO''Neil, SVVerhoest, PR Heterocyclic spiro compounds as MAGL inhibitors US Patent  US10858373 Publication Date 12/8/2020 
Target
Name:
Monoglyceride lipase
Synonyms:
HU-K5 Lysophospholipase-like MGL MGLL_HUMAN
Type:
Hydrolase
Mol. Mass.:
33264.56
Organism:
Homo sapiens (Human)
Description:
Human recombinant MGL (Cayman Chemical, cat# 10008354).
Residue:
303
  
Inhibitor
Name:
BDBM474418
Synonyms:
US10858373, Example 16
Type:
Small organic molecule
Emp. Form.:
C19H20F9N3O3
Mol. Mass.:
509.366
SMILES:
FC(F)(F)C(OC(=O)N1CCC2(CC1)CN(Cc1ccc(nc1)C(F)(F)F)CCO2)C(F)(F)F
: