Target
Monoglyceride lipase
Ligand
BDBM474422
Substrate
Meas. Tech.
MAGL Enzymatic Assay (0 minute)
IC50
255±n/a nM
Citation
 Brodney, MAButler, CRMcAllister, LAHelal, CJO''Neil, SVVerhoest, PR Heterocyclic spiro compounds as MAGL inhibitors US Patent  US10858373 Publication Date 12/8/2020 
Target
Name:
Monoglyceride lipase
Synonyms:
HU-K5 Lysophospholipase-like MGL MGLL_HUMAN
Type:
Hydrolase
Mol. Mass.:
33264.56
Organism:
Homo sapiens (Human)
Description:
Human recombinant MGL (Cayman Chemical, cat# 10008354).
Residue:
303
  
Inhibitor
Name:
BDBM474422
Synonyms:
US10858373, Example 20
Type:
Small organic molecule
Emp. Form.:
C17H20F6N4O3
Mol. Mass.:
442.3561
SMILES:
FC(F)(F)C(OC(=O)N1CCC2(CC1)CN(Cc1cnccn1)CCO2)C(F)(F)F
: