Target
Monoglyceride lipase
Ligand
BDBM474428
Substrate
Meas. Tech.
MAGL Enzymatic Assay (30 minute)
IC50
539±n/a nM
Citation
 Brodney, MAButler, CRMcAllister, LAHelal, CJO''Neil, SVVerhoest, PR Heterocyclic spiro compounds as MAGL inhibitors US Patent  US10858373 Publication Date 12/8/2020 
Target
Name:
Monoglyceride lipase
Synonyms:
HU-K5 Lysophospholipase-like MGL MGLL_HUMAN
Type:
Hydrolase
Mol. Mass.:
33264.56
Organism:
Homo sapiens (Human)
Description:
Human recombinant MGL (Cayman Chemical, cat# 10008354).
Residue:
303
  
Inhibitor
Name:
BDBM474428
Synonyms:
US10858373, Example 26
Type:
Small organic molecule
Emp. Form.:
C18H23N5O5
Mol. Mass.:
389.4057
SMILES:
O=C(ON1C(=O)CCC1=O)N1CCC2(CC1)CN(Cc1cnccn1)CCO2
: